{"text_format":"1","workbook":"xlsx","n_sheets":7,"sheets":["ACTA","ARBITRES","ALINEABLES","jugcopafem","NO ALINEABLES","equips","actescf.txt"],"not_rendered":{"charts":0,"images":0,"macros":1,"external_links":0,"defined_names":24,"comments":0,"pivot_tables":0},"unopened":[],"bounds":{"document_bytes":16777216,"sheet_cells":100000,"rows_first":2000,"rows_last":500,"rows_between":2000,"halvings":0,"cell_chars":16384,"cell_head_chars":4096},"cells_cut":0,"cells_raw":0,"read":"whole","date_system":"1900"}

{"sheet":"ACTA","index":0,"n_rows":63,"n_cols":128,"rows_kept":63,"cut":false,"hidden":false,"merged":[[3,7,4,8],[3,9,4,17],[8,1,9,3],[8,15,9,17],[13,18,13,25],[14,18,14,25],[15,18,15,25],[8,4,8,6],[8,18,8,20],[10,18,10,25],[3,1,4,2],[6,1,7,10],[9,4,9,14],[3,3,4,6],[10,2,10,3],[17,1,18,1],[11,12,11,14],[14,12,14,14],[12,4,12,11],[14,2,14,3],[11,2,11,3],[12,2,12,3],[18,2,18,3],[15,4,15,11],[16,2,16,3],[18,26,18,28],[17,2,17,3],[18,16,18,17],[17,16,17,17],[17,12,17,14],[18,12,18,14],[12,26,12,28],[15,2,15,3],[18,18,18,25],[15,16,15,17],[16,4,16,11],[13,2,13,3],[18,4,18,11],[15,12,15,14],[10,39,10,40],[15,26,15,28],[11,4,11,11],[23,30,24,42],[14,26,14,28],[11,18,11,25],[14,4,14,11],[14,16,14,17],[16,12,16,14],[17,42,18,42],[17,38,18,38],[13,12,13,14],[10,16,10,17],[11,16,11,17],[10,4,10,11],[10,12,10,14],[13,4,13,11],[17,15,18,15],[17,4,17,11],[12,16,12,17],[12,12,12,14],[13,16,13,17],[17,26,17,28],[16,16,16,17],[3,28,3,30],[3,24,3,27],[10,35,10,36],[10,29,10,30],[10,31,10,32],[17,18,17,25],[4,31,4,32],[8,26,8,28],[12,18,12,25],[10,33,10,34],[4,22,4,23],[9,18,9,28],[3,20,4,21],[16,18,16,25],[3,31,3,32],[3,22,3,23],[11,26,11,28],[16,26,16,28],[13,26,13,28],[3,18,4,19],[25,35,25,42],[25,30,25,34],[17,30,18,30],[17,31,18,31],[4,28,4,30],[10,26,10,28],[17,29,18,29],[17,36,18,36],[17,35,18,35],[17,33,18,33],[4,24,4,27],[7,31,7,32],[8,31,8,32],[21,39,21,42],[17,37,18,37],[17,39,18,39],[20,29,20,38],[17,34,18,34],[17,32,18,32],[10,41,10,42],[19,33,19,35],[17,41,18,41],[10,37,10,38],[17,40,18,40]]}
[null,null,null,null,null,null,null,null,null,null,null,null,null,null,null,{"$f":"\"T:\\TEMPORADA 22 - 23\\AREA ESPORTIVA\\COMPETICIO\\COPA FEMENINA\\ACTES\\PDFS\\\"&D4&\"-\"&ALINEABLES!D5&\"-\"&ALINEABLES!L5","v":{"$error":"#N/A"}}]
[null,"FEDERACIÓ CATALANA DE TENNIS DE TAULA - COMUNICACIÓ DE RESULTATS I ACTA - COPA CATALANA FEMENINA - TEMPORADA 2022/2023",null,null,null,null,null,null,null,null,null,null,null,null,null,null,null,null,null,null,null,null,null,null,null,null,null,null,null,null,null,null,null,null,null,null,null,null,null,null,null,null,null,null,null,"v.5"]
[null,null,null,null,null,null,null,null,null,"SEU:",null,null,null,null,null,null,null,null,null,null,null,null,null,null,null,null,null,null,null,null,null,null,null,null,null,null,null,null,null,null,null,null,null,null,null,null,null,null,null,null,null,null,null,null,null,null,null,null,null,null,null,null,null,null,null,null,null,null,null,null,null,null,null,null,null,null,null,null,null,null,null,null,null,null,null,null,null,null,null,null,null,null,null,{"$f":"IFERROR(MATCH(#REF!,#REF!,0),\"\")","v":""}]
[{"$f":"IF(S7=\"\",0,1)","v":1},"ACTA:",null,null,null,null,null,null,null,{"$f":"IF(AF8<>\"\",AH8,IFERROR(VLOOKUP(D4,actes,8,0),\"\"))","v":""},null,null,null,null,null,null,null,null," GR:",null,{"$f":"LEFT(D4,2)","v":""},null,"  Dia:",null,{"$f":"IFERROR(VLOOKUP(D4,ACTES5,2,0),\"\")","v":""},null,null,null,"Local:",null,null,{"$f":"IF(AF8<>\"\",AF8,IFERROR(VLOOKUP(D4,actes,4,0),\"\"))","v":""},null,{"$f":"IF(AF8<>\"\",AH8,IFERROR(VLOOKUP(D4,actes,5,0),\"\"))","v":""},null,null,null,null,null,null,null,null,null,null,null,null,null,null,null,null,null,null,null,null,null,null,null,null,null,null,null,null,null,null,null,null,null,null,null,null,null,null,null,null,null,null,null,null,null,null,null,null,null,null,null,null,null,null,null,null,null,null,null,{"$f":"IFERROR(CP3+1,\"\")","v":""},"V2 Faltaven llicències A.LLIÇÀ"]
[{"$f":"IF(S8=\"\",0,1)","v":0},null,null,null,null,null,null,null,null,null,null,null,null,null,null,null,null,null,null,null,null,null,"Hora:",null,{"$f":"IFERROR(VLOOKUP(D4,ACTES5,3,0),\"\")","v":""},null,null,null,"Visitant:",null,null,{"$f":"IF(AF9<>\"\",AF9,IFERROR(VLOOKUP(D4,actes,6,0),\"\"))","v":""},null,{"$f":"IF(AF9<>\"\",AH9,IFERROR(VLOOKUP(D4,actes,7,0),\"\"))","v":""},null,null,null,null,null,null,null,null,null,null,null,null,null,null,null,null,null,null,null,null,null,null,null,null,null,null,null,null,null,null,null,null,null,null,null,null,null,null,null,null,null,null,null,null,null,null,null,null,null,null,null,null,null,null,null,null,null,null,null,{"$f":"IFERROR(CP4+1,\"\")","v":""},"V3 No arribava el rang al final a alineables"]
[{"$f":"A4&A5","v":"10"},null,null,null,null,null,null,null,{"$f":"IF(ISERROR(D4),\"E\",\"\")","v":""},null,null,null,null,null,null,null,null,null,null,null,null,null,null,null,null,null,null,null,null,null,null,null,null,null,null,null,null,null,null,null,null,null,null,null,null,null,null,null,null,null,null,null,null,null,null,null,null,null,null,null,null,null,null,null,null,null,null,null,null,null,null,null,null,null,null,null,null,null,null,null,null,null,null,null,null,null,null,null,null,null,null,null,null,"","V3 Captura número d¡àrbitre"]
[null,"Assignar lletres (Obligatori)",null,null,null,null,null,null,null,null,null," Local juga amb \"ABC\"",null,null,null,null,null,null,"x"," <- Poseu una \"x\" o deixeu en blanc",null,null,null,null,null,null,null,null,null,null,null,"Introducció manual d'equip (Posar núm d'equip)",null,null,null,null,null,null,null,null,null,null,null,null,null,null,null,null,null,null,null,null,null,null,null,null,null,null,null,null,null,null,null,null,null,null,null,null,null,null,null,null,null,null,null,null,null,null,null,null,null,null,null,null,null,null,null,null,null,null,null,null,null,"","V4 arreglat capura guanyador"]
[null,null,null,null,null,null,null,null,null,null,null," Local juga amb \"YXZ\"",null,null,null,null,null,null,null," <- Poseu una \"x\" o deixeu en blanc",null,null,null,null,null,null,null,null,null,null,null,null,null,{"$f":"IF(AF8<>\"\",VLOOKUP(AF8,equips,2,0),\"\")","v":""},null,null,null,null,null,null,null,null,null,null,null,null,null,null,null,null,null,null,null,null,null,null,null,null,null,null,null,null,null,null,null,null,null,null,null,null,null,null,null,null,null,null,null,null,null,null,null,null,null,null,null,null,null,null,null,null,null,null,null,"","V5","arreglat guanyador"]
[null,"Eq.ABC",null,null,{"$f":"IFERROR(IF(A6=\"11\",\"ERROR\",IF(A6=\"00\",\"\",IF(A4=1,AF4*1,AF5*1))),\"\")","v":""},null,null,null,null,null,null,null,null,null,null,"Eq.XYZ",null,null,{"$f":"IFERROR(IF(A6=\"11\",\"ERROR\",IF(A6=\"00\",\"\",IF(A4=1,AF5*1,AF4*1))),\"\")","v":""},null,null,null,null,null,null,null,null,null,null,null,null,null,null,{"$f":"IF(AF9<>\"\",VLOOKUP(AF9,equips,2,0),\"\")","v":""},null,null,null,null,null,null,null,null,null,null,null,null,null,null,null,null,null,null,null,null,null,null,null,null,null,null,null,null,null,null,null,null,null,null,null,null,null,null,null,null,null,null,null,null,null,null,null,null,null,null,null,null,null,null,null,null,null,null,null,""]
[null,null,null,null,{"$f":"IF(A6=\"11\",\"ERROR\",IF(A6=\"00\",\"\",IF(A4=1,AH4,AH5)))","v":""},null,null,null,null,null,null,null,null,null,null,null,null,null,{"$f":"IF(A6=\"11\",\"ERROR\",IF(A6=\"00\",\"\",IF(A4=1,AH5,AH4)))","v":""},null,null,null,null,null,null,null,null,null,null,null,null,null,null,null,null,null,null,null,null,null,null,null,null,null,null,null,null,null,null,null,null,null,null,null,null,null,null,null,null,null,null,null,null,null,null,null,null,null,null,null,null,null,null,null,null,null,null,null,null,null,null,null,null,null,null,null,null,null,null,null,null,null,null,""]
[null,"Ll",null,null,"Jugador",null,null,null,null,null,null,null,"Club",null,null,"Ll","NP",null,"Jugador",null,null,null,null,null,null,null,"Club",null,null,"1r joc",null,"2n joc",null,"3r joc",null,"4t joc",null,"5è joc",null,"Parcial",null,"General",null,null,null,null,null,null,null,null,null,null,null,null,null,null,null,null,null,null,null,null,null,null,null,null,null,null,null,null,null,null,null,null,null,null,null,null,null,null,null,null,null,null,null,null,null,null,null,null,null,null,null,""]
[null,"A",null,null,{"$f":"IFERROR(IF(D4=\"\",\"\",IF(A6=\"FALSOFALSO\",\"Falta assignar lletres\",IF(I6=\"E\",\"Falta determinar encontre\",IF(C12<>\"\",VLOOKUP(C12,_pers2,2,0),\"\")))),\"\")","v":""},null,null,null,null,null,null,null,{"$f":"IFERROR(IF(CF20=1,\"\",IF(A6=\"FALSOFALSO\",\"\",IF(I6=\"E\",\"\",IF(C12<>\"\",VLOOKUP(C12,_pers2,6,0),\"\")))),\"\")","v":""},null,null,"X",null,null,{"$f":"IFERROR(IF(Q12<>\"\",VLOOKUP(Q12,_pers2,2,0),\"\"),\"NO LLIC\")","v":""},null,null,null,null,null,null,null,{"$f":"IFERROR(IF(CF20=1,\"\",IF(A6=\"FALSOFALSO\",\"\",IF(I6=\"E\",\"\",IF(Q12<>\"\",VLOOKUP(Q12,_pers2,6,0),\"\")))),\"\")","v":""},null,null,null,null,null,null,null,null,null,null,null,null,{"$f":"IF(BA12+BG12>2,BA12,\"\")","v":""},{"$f":"IF(BA12+BG12>2,BG12,\"\")","v":""},{"$f":"IF(BI12+BJ12<>0,BI12,\"\")","v":""},{"$f":"IF(BI12+BJ12<>0,BJ12,\"\")","v":""},null,null,null,null,{"$f":"IF(AD12>AE12,1,0)","v":0},{"$f":"IF(AF12>AG12,1,0)","v":0},{"$f":"IF(AH12>AI12,1,0)","v":0},{"$f":"IF(AJ12>AK12,1,0)","v":0},{"$f":"IF(AL12>AM12,1,0)","v":0},{"$f":"SUM(AV12:AZ12)","v":0},{"$f":"IF(AE12>AD12,1,0)","v":0},{"$f":"IF(AG12>AF12,1,0)","v":0},{"$f":"IF(AI12>AH12,1,0)","v":0},{"$f":"IF(AK12>AJ12,1,0)","v":0},{"$f":"IF(AM12>AL12,1,0)","v":0},{"$f":"SUM(BB12:BF12)","v":0},null,{"$f":"IF(BA12>2,1,0)","v":0},{"$f":"IF(BG12>2,1,0)","v":0},null,null,null,null,null,null,null,null,null,null,null,null,null,null,null,null,null,null,null,null,null,null,null,null,null,null,null,null,null,null,null,""]
[null,"B",null,null,{"$f":"IFERROR(IF(C13<>\"\",VLOOKUP(C13,_pers2,2,0),\"\"),\"NO LLIC\")","v":""},null,null,null,null,null,null,null,{"$f":"IF(CF21=1,\"\",IF(A6=\"FALSOFALSO\",\"\",IF(I7=\"E\",\"\",IF(C13<>\"\",VLOOKUP(C13,_pers2,6,0),\"\"))))","v":""},null,null,"Y",null,null,{"$f":"IFERROR(IF(Q13<>\"\",VLOOKUP(Q13,_pers2,2,FALSE),\"\"),\"NO LLIC\")","v":""},null,null,null,null,null,null,null,{"$f":"IFERROR(IF(CF21=1,\"\",IF(A6=\"FALSOFALSO\",\"\",IF(6=\"E\",\"\",IF(Q13<>\"\",VLOOKUP(Q13,_pers2,6,0),\"\")))),\"\")","v":""},null,null,null,null,null,null,null,null,null,null,null,null,"","",{"$f":"IF(BI13+BJ13<>0,BI12+BI13,\"\")","v":""},{"$f":"IF(BI13+BJ13<>0,BJ12+BJ13,\"\")","v":""},null,null,null,null,0,0,0,0,0,0,0,0,0,0,0,0,null,{"$f":"IF(BA13>2,1,0)","v":0},{"$f":"IF(BG13>2,1,0)","v":0},null,null,null,null,null,null,null,null,null,null,null,null,null,null,null,null,null,null,null,null,null,null,null,null,null,null,null,null,null,null,null,""]
[null,"db",{"$f":"C18&\"  \"&C19","v":"  "},null,{"$f":"E18&\" /  \"&E19","v":" /  "},null,null,null,null,null,null,null,{"$f":"M18","v":""},null,null,"db",{"$f":"Q18&\"  \"&Q19","v":"  "},null,{"$f":"S18&\" /  \"&S19","v":" /  "},null,null,null,null,null,null,null,{"$f":"AA18","v":""},null,null,null,null,null,null,null,null,null,null,null,null,"","",{"$f":"IF(BI14+BJ14<>0,AP13+BI14,\"\")","v":""},{"$f":"IF(BI14+BJ14<>0,AQ13+BJ14,\"\")","v":""},null,null,null,null,0,0,0,0,0,0,0,0,0,0,0,0,null,0,0,null,null,null,null,null,null,null,null,null,null,null,null,null,null,null,null,null,null,null,null,null,null,null,null,null,null,null,null,null,null,null,""]
[null,"A",{"$f":"IF(C12<>0,C12,\"\")","v":""},null,{"$f":"IFERROR(IF(C15<>\"\",VLOOKUP(C15,_pers2,2,0),\"\"),\"NO LLIC\")","v":""},null,null,null,null,null,null,null,{"$f":"IFERROR(IF(CF23=1,\"\",IF(A9=\"FALSOFALSO\",\"\",IF(I9=\"E\",\"\",IF(C15<>\"\",VLOOKUP(C15,_pers2,6,0),\"\")))),\"\")","v":""},null,null,"y",{"$f":"IF(Q13<>0,Q13,\"\")","v":""},null,{"$f":"IFERROR(IF(Q15<>\"\",VLOOKUP(Q15,_pers2,2,FALSE),\"\"),\"NO LLIC\")","v":""},null,null,null,null,null,null,null,{"$f":"IFERROR(IF(CF23=1,\"\",IF(A9=\"FALSOFALSO\",\"\",IF(I9=\"E\",\"\",IF(Q15<>\"\",VLOOKUP(Q15,_pers2,6,0),\"\")))),\"\")","v":""},null,null,null,null,null,null,null,null,null,null,null,null,"","",{"$f":"IF(BI15+BJ15<>0,AP14+BI15,\"\")","v":""},{"$f":"IF(BI15+BJ15<>0,AQ14+BJ15,\"\")","v":""},null,null,null,null,0,0,0,0,0,0,0,0,0,0,0,0,null,0,0,null,null,null,null,null,null,null,null,null,null,null,null,null,null,null,null,null,null,null,null,null,null,null,null,null,null,null,null,null,null,null,""]
{"$rows_left_out":49}
{"sheet":"ARBITRES","index":1,"n_rows":41,"n_cols":3,"rows_kept":41,"cut":false,"hidden":true,"merged":[]}
[null,"ARBITRES"]
[]
[null,381,"ALTARRIBA CUNILL, RAMON"]
[null,5613,"ARAGALL CHECA, NIL"]
[null,11563,"ARAGALL MUSACH, JORDI"]
[null,6545,"BARCELÓ MAS, PAU"]
[null,931,"BOSCH PASTOR, ENRIC"]
[null,7726,"CAIRÓ PONT, GUILLEM"]
[null,286,"CARMONA RODRIGUEZ, MANUEL"]
[null,3375,"CASADO PAGES, ENRIC"]
[null,987,"CASADÓ PAGÉS, XAVIER"]
[null,666,"CASAS CASAS, JORDI"]
[null,292,"CHACON SIMEON, ALEJANDRO"]
[null,1333,"COLINAS CASTELLÀ, DAVID"]
[null,850,"DURAN SALGUEIRO, ROBERTO CARLOS"]
{"$rows_left_out":27}
{"sheet":"ALINEABLES","index":2,"n_rows":68,"n_cols":16,"rows_kept":68,"cut":false,"hidden":false,"merged":[]}
[null,"LLICÈNCIES ALINEABLES (Excepte canvis d'\"STATUS\")",null,null,null,null,null,null,null,null,null,null,null,null,null,"TDM 2022/2023"]
[null,"QUE ES MOSTRI EL NOM NO PRESUPOSA QUE SIGUI CORRECTE L'ALINEACIÓ (depèn de l'status adquirit)"]
[null,"(AB) La primera alineació a l'equip \"A\" o \"B\" determinarà el seu enquadrament"]
[]
[null,{"$f":"ACTA!AF4*1","v":{"$error":"#VALUE!"}},{"$f":"ACTA!AH4","v":""},{"$f":"VLOOKUP(C5,CLUBS,2,0)","v":{"$error":"#N/A"}},"NAC","EDA","LLIC","A/B",null,{"$f":"ACTA!AF5*1","v":{"$error":"#VALUE!"}},{"$f":"ACTA!AH5","v":""},{"$f":"VLOOKUP(K5,CLUBS,2,0)","v":{"$error":"#N/A"}},"NAC","EDA","LLIC","A/B"]
[{"$f":"IFERROR(MATCH(B5*1,jugcopafem!L3:L138,0),\"\")","v":""},{"$f":"IF(D6<>$D$5,\"\",INDEX(jugcopafem!$A$3:$O$230,A6,3))","v":{"$error":"#VALUE!"}},{"$f":"IF(D6<>$D$5,\"\",INDEX(INDEX,A6,4))","v":{"$error":"#VALUE!"}},{"$f":"IF(INDEX(INDEX,A6,12)<>$B$5,\"\",INDEX(INDEX,A6,8))","v":{"$error":"#VALUE!"}},{"$f":"IF(D6<>$D$5,\"\",INDEX(INDEX,A6,6))","v":{"$error":"#VALUE!"}},{"$f":"IF(D6<>$D$5,\"\",INDEX(INDEX,A6,7))","v":{"$error":"#VALUE!"}},{"$f":"IF(D6<>$D$5,\"\",INDEX(INDEX,A6,9))","v":{"$error":"#VALUE!"}},{"$f":"IF(D6<>$D$5,\"\",INDEX(INDEX,A6,2))","v":{"$error":"#VALUE!"}},{"$f":"IFERROR(MATCH(J5*1,jugcopafem!L3:L138,0),\"\")","v":""},{"$f":"IFERROR(IF(L6<>$L$5,\"\",INDEX(jugcopafem!$A$3:$O$230,I6,3)),\"\")","v":""},{"$f":"IFERROR(IF(L6<>$L$5,\"\",INDEX(INDEX,I6,4)),\"\")","v":""},{"$f":"IFERROR(IF(INDEX(INDEX,I6,12)<>$J$5,\"\",INDEX(INDEX,I6,8)),\"\")","v":""},{"$f":"IF(L6<>$L$5,\"\",INDEX(INDEX,I6,6))","v":{"$error":"#N/A"}},{"$f":"IF(L6<>$L$5,\"\",INDEX(INDEX,I6,7))","v":{"$error":"#N/A"}},{"$f":"IF(L6<>$L$5,\"\",INDEX(INDEX,I6,9))","v":{"$error":"#N/A"}},{"$f":"IF(L6<>$L$5,\"\",INDEX(INDEX,I6,2))","v":{"$error":"#N/A"}}]
[{"$f":"IFERROR(A6+1,\"\")","v":""},{"$f":"IF(D7<>$D$5,\"\",INDEX(jugcopafem!$A$3:$O$230,A7,3))","v":{"$error":"#VALUE!"}},{"$f":"IF(D7<>$D$5,\"\",INDEX(INDEX,A7,4))","v":{"$error":"#VALUE!"}},{"$error":"#VALUE!"},{"$error":"#VALUE!"},{"$error":"#VALUE!"},{"$error":"#VALUE!"},{"$error":"#VALUE!"},{"$f":"IFERROR(I6+1,\"\")","v":""},{"$f":"IFERROR(IF(L7<>$L$5,\"\",INDEX(jugcopafem!$A$3:$O$230,I7,3)),\"\")","v":""},"","",{"$error":"#N/A"},{"$error":"#N/A"},{"$error":"#N/A"},{"$error":"#N/A"}]
["",{"$f":"IF(D8<>$D$5,\"\",INDEX(jugcopafem!$A$3:$O$230,A8,3))","v":{"$error":"#VALUE!"}},{"$error":"#VALUE!"},{"$error":"#VALUE!"},{"$error":"#VALUE!"},{"$error":"#VALUE!"},{"$error":"#VALUE!"},{"$error":"#VALUE!"},{"$f":"IFERROR(I7+1,\"\")","v":""},{"$f":"IFERROR(IF(L8<>$L$5,\"\",INDEX(jugcopafem!$A$3:$O$230,I8,3)),\"\")","v":""},"","",{"$error":"#N/A"},{"$error":"#N/A"},{"$error":"#N/A"},{"$error":"#N/A"}]
["",{"$f":"IF(D9<>$D$5,\"\",INDEX(jugcopafem!$A$3:$O$230,A9,3))","v":{"$error":"#VALUE!"}},{"$error":"#VALUE!"},{"$error":"#VALUE!"},{"$error":"#VALUE!"},{"$error":"#VALUE!"},{"$error":"#VALUE!"},{"$error":"#VALUE!"},"",{"$f":"IFERROR(IF(L9<>$L$5,\"\",INDEX(jugcopafem!$A$3:$O$230,I9,3)),\"\")","v":""},"","",{"$error":"#N/A"},{"$error":"#N/A"},{"$error":"#N/A"},{"$error":"#N/A"}]
["",{"$f":"IF(D10<>$D$5,\"\",INDEX(jugcopafem!$A$3:$O$230,A10,3))","v":{"$error":"#VALUE!"}},{"$error":"#VALUE!"},{"$error":"#VALUE!"},{"$error":"#VALUE!"},{"$error":"#VALUE!"},{"$error":"#VALUE!"},{"$error":"#VALUE!"},"",{"$f":"IFERROR(IF(L10<>$L$5,\"\",INDEX(jugcopafem!$A$3:$O$230,I10,3)),\"\")","v":""},"","",{"$error":"#N/A"},{"$error":"#N/A"},{"$error":"#N/A"},{"$error":"#N/A"}]
["",{"$f":"IF(D11<>$D$5,\"\",INDEX(jugcopafem!$A$3:$O$230,A11,3))","v":{"$error":"#VALUE!"}},{"$error":"#VALUE!"},{"$error":"#VALUE!"},{"$error":"#VALUE!"},{"$error":"#VALUE!"},{"$error":"#VALUE!"},{"$error":"#VALUE!"},"",{"$f":"IFERROR(IF(L11<>$L$5,\"\",INDEX(jugcopafem!$A$3:$O$230,I11,3)),\"\")","v":""},"","",{"$error":"#N/A"},{"$error":"#N/A"},{"$error":"#N/A"},{"$error":"#N/A"}]
["",{"$f":"IF(D12<>$D$5,\"\",INDEX(jugcopafem!$A$3:$O$230,A12,3))","v":{"$error":"#VALUE!"}},{"$error":"#VALUE!"},{"$error":"#VALUE!"},{"$error":"#VALUE!"},{"$error":"#VALUE!"},{"$error":"#VALUE!"},{"$error":"#VALUE!"},"",{"$f":"IFERROR(IF(L12<>$L$5,\"\",INDEX(jugcopafem!$A$3:$O$230,I12,3)),\"\")","v":""},"","",{"$error":"#N/A"},{"$error":"#N/A"},{"$error":"#N/A"},{"$error":"#N/A"}]
["",{"$f":"IF(D13<>$D$5,\"\",INDEX(jugcopafem!$A$3:$O$230,A13,3))","v":{"$error":"#VALUE!"}},{"$error":"#VALUE!"},{"$error":"#VALUE!"},{"$error":"#VALUE!"},{"$error":"#VALUE!"},{"$error":"#VALUE!"},{"$error":"#VALUE!"},"",{"$f":"IFERROR(IF(L13<>$L$5,\"\",INDEX(jugcopafem!$A$3:$O$230,I13,3)),\"\")","v":""},"","",{"$error":"#N/A"},{"$error":"#N/A"},{"$error":"#N/A"},{"$error":"#N/A"}]
["",{"$f":"IFERROR(IF(D14<>$D$5,\"\",INDEX(jugcopafem!$A$3:$O$230,A14,3)),\"\")","v":""},{"$f":"IFERROR(IF(D14<>$D$5,\"\",INDEX(INDEX,A14,4)),\"\")","v":""},{"$f":"IFERROR(IF(INDEX(INDEX,A14,12)<>$B$5,\"\",INDEX(INDEX,A14,8)),\"\")","v":""},{"$error":"#N/A"},{"$error":"#N/A"},{"$error":"#N/A"},{"$error":"#N/A"},"",{"$f":"IFERROR(IF(L14<>$L$5,\"\",INDEX(jugcopafem!$A$3:$O$230,I14,3)),\"\")","v":""},"","",{"$error":"#N/A"},{"$error":"#N/A"},{"$error":"#N/A"},{"$error":"#N/A"}]
["",{"$f":"IFERROR(IF(D15<>$D$5,\"\",INDEX(jugcopafem!$A$3:$O$230,A15,3)),\"\")","v":""},"","",{"$f":"IF(D15<>$D$5,\"\",INDEX(INDEX,A15,6))","v":{"$error":"#N/A"}},{"$f":"IF(D15<>$D$5,\"\",INDEX(INDEX,A15,7))","v":{"$error":"#N/A"}},{"$f":"IF(D15<>$D$5,\"\",INDEX(INDEX,A15,9))","v":{"$error":"#N/A"}},{"$f":"IF(D15<>$D$5,\"\",INDEX(INDEX,A15,2))","v":{"$error":"#N/A"}},"",{"$f":"IFERROR(IF(L15<>$L$5,\"\",INDEX(jugcopafem!$A$3:$O$230,I15,3)),\"\")","v":""},"","",{"$error":"#N/A"},{"$error":"#N/A"},{"$error":"#N/A"},{"$error":"#N/A"}]
{"$rows_left_out":54}
{"sheet":"jugcopafem","index":3,"n_rows":148,"n_cols":12,"rows_kept":148,"cut":false,"hidden":true,"merged":[]}
[]
["INDEX","AB","NP","TITULAR","SEX","NAC","ED22/23","CLUB","CLASSE","ANY","observ","EQUIP"]
[1,"ABC",15239,"ARAQUE Aina","F","ESP","ALE-1","GANXETA","A2",2011,"",101]
[2,"ABC",14468,"BAKSEJEVA Varvara","F","NO NAC","BEN-1","GANXETA","C",2013,"",101]
[3,"ABC",15046,"BAQUEDANO Sofia","F","ESP","INF-1","GANXETA","A2",2009,"",101]
[4,"ABC",16257,"BRIGITTE Eerland","F","NO NAC","SEN","GANXETA","A2",1994,"",101]
[5,"ABC",16278,"ENRIQUEZ Malbelyn Adriana","F","NO NAC","SEN","GANXETA","A2",1995,"",101]
[6,"ABC",16261,"GARCÍA Alba","F","ESP","JUV-2","GANXETA","A2",2005,"",101]
[7,"ABC",14542,"KUZNETSOVA Mariia","F","NO NAC","INF-2","GANXETA","A2",2008,"",101]
[8,"ABC",16538,"LAM Yee Lok","F","NO NAC","SEN","GANXETA","A2",1996,"",101]
[9,"ABC",14588,"MANRESA Jana","F","ESP","ALE-1","GANXETA","A2",2011,"",101]
[10,"ABC",14535,"MARTINEZ Kira","F","ESP","PRE-0","GANXETA","C",2014,"",101]
[11,"ABC",4342,"NIKOLAEVA Vesela","F","ESP","V+50","GANXETA","B",1966,"",101]
[12,"ABC",14538,"NIKOLAEWNA Sofia","F","ESP","BEN-1","GANXETA","C",2013,"",101]
[13,"ABC",16260,"RAD Elvira","F","ESP","JUV-3","GANXETA","A2",2004,"",101]
{"$rows_left_out":134}
{"sheet":"NO ALINEABLES","index":4,"n_rows":0,"n_cols":0,"rows_kept":0,"cut":false,"hidden":true,"merged":[]}

{"sheet":"equips","index":5,"n_rows":14,"n_cols":5,"rows_kept":14,"cut":false,"hidden":true,"merged":[]}
["equips fix 2022/2023"]
["EQ","EQUIP"]
[101,"REUS GANXETS A","GANXETA",101,"214"]
[102,"REUS GANXETS C","GANXETC",102,"214"]
[103,"REUS GANXETS B","GANXETB",103,"214"]
[104,"CTT CAMBRILS","CAMBRI",104,"162"]
[105,"CTT VILABLAREIX","VILABL",105,"101"]
[106,"CTT ATENEU 1882","ATEN82",106,"007"]
[107,"ICELAND -ELS 8 LA GARRIGA","ELS 8",107,"025"]
[108,"CTT AMICS TERRASSA","AMICS",108,"024"]
[109,"CTT VILANOVA","VILANO",109,"068"]
[110,"VILASSAR DE MAR L'OBRERA","VILASS",110,"240"]
[111,"CN SABADELL","CNSABA",111,"076"]
[112,"BORGES ENVELATS VALL","BORGES",112,"133"]

{"sheet":"actescf.txt","index":6,"n_rows":173,"n_cols":8,"rows_kept":173,"cut":false,"hidden":true,"merged":[]}
["actescf.txt","Temp.22/23","2022-09-20T18:20:12.790"]
["ACTA","DIA DE JOC","HORA","EQ1","EQUIP LOCAL","EQ2","EQUIP VISITANT","SEU"]
["C1S1E1","2022-10-15","10:00 h",101,"REUS GANXETS A",105,"CTT VILABLAREIX","ATENEU 1882"]
["C1S1E2","2022-10-15","10:00 h",102,"REUS GANXETS C",106,"CTT ATENEU 1882","ATENEU 1882"]
["C1S1E3","2022-10-15","10:00 h",103,"REUS GANXETS B",107,"ICELAND -ELS 8 LA GARRIGA","ATENEU 1882"]
["C1S1E4","2022-10-15","10:00 h",104,"CTT CAMBRILS",108,"CTT AMICS TERRASSA","ATENEU 1882"]
["C1S2E1","2022-10-15","12:00 h",101,"REUS GANXETS A",106,"CTT ATENEU 1882","ATENEU 1882"]
["C1S2E2","2022-10-15","12:00 h",102,"REUS GANXETS C",107,"ICELAND -ELS 8 LA GARRIGA","ATENEU 1882"]
["C1S2E3","2022-10-15","12:00 h",103,"REUS GANXETS B",108,"CTT AMICS TERRASSA","ATENEU 1882"]
["C1S2E4","2022-10-15","12:00 h",104,"CTT CAMBRILS",105,"CTT VILABLAREIX","ATENEU 1882"]
["C1S3E1","2022-10-15","16:00 h",101,"REUS GANXETS A",107,"ICELAND -ELS 8 LA GARRIGA","ATENEU 1882"]
["C1S3E2","2022-10-15","16:00 h",102,"REUS GANXETS C",108,"CTT AMICS TERRASSA","ATENEU 1882"]
["C1S3E3","2022-10-15","16:00 h",103,"REUS GANXETS B",105,"CTT VILABLAREIX","ATENEU 1882"]
["C1S3E4","2022-10-15","16:00 h",104,"CTT CAMBRILS",106,"CTT ATENEU 1882","ATENEU 1882"]
["C1S4E1","2022-10-15","18:00 h",101,"REUS GANXETS A",108,"CTT AMICS TERRASSA","ATENEU 1882"]
{"$rows_left_out":158}